frais
type: Concept
subject: Pedology @en
subject: Pédologie
definition: Qualifie l'état d'humidité d'un horizon ressenti comme intermédiaire entre un état humide et un état sec. (Source : INRA)
in scheme: PLP
preferred label: slightly moist @en
related: http://opendata.inrae.fr/PLP/344
top concept of: PLP

RDF description of
primary topic: frais