RDF description of
primary topic: capillary zone

capillary zone
type: Concept
subject: Pedology
subject: Hydrologie @fr
subject: Hydrology
subject: Pédologie @fr
alternative label: capillary fringe zone
definition: Couche de sol saturée ou quasi-saturée par de l'eau capillaire, située au-dessus d'une nappe phréatique et en continuité avec elle. (Source : INRA) @fr
in scheme: PLP
preferred label: frange capillaire @fr
related: http://opendata.inrae.fr/PLP/292
related: http://opendata.inrae.fr/PLP/696
top concept of: PLP