RDF description of
primary topic: gammamétrie

gammamétrie
type: Concept
subject: Pedology @en
subject: Pédologie
definition: Techniques de mesure in situ des densités apparentes ou des humidités utilisant une source radioactive de rayons gamma. (Source : INRA)
in scheme: PLP
note: On distingue la gammamétrie de profondeur où l'on fait descendre une source et un compteur des rayons rétrodiffusés dans un tube d'accès et la gammamétrie de surface où l'on opère sur des marches creusées dans le sol. Les inconvénients de ces méthodes sont : un matériel coûteux, nécessitant des précautions d'entretien et d'utilisation, la présence de sources radioactives posant des problèmes de sécurité et des étalonnages complexes. Les avantages des méthodes gammamétriques sont de ne pas détruire ni beaucoup perturber le sol étudié et la rapidité. Avec la méthode de gammamétrie de profondeur à transmission il est possible d'effectuer des mesures sur de nombreuses tranches de sol minces et successives, ceci dans un temps très bref et d'effectuer des suivis dans le temps, à la condition de pouvoir suivre également l'évolution de la teneur en eau du volume mesuré. Pour la mesure des humidités in situ, ces techniques sont désormais remplacées par des techniques moins coûteuses et surtout moins contraignantes comme la TDR, la mesure de capacité ou la dissipation de la chaleur. (Source : INRA)
preferred label: gamma radiometry @en
related: http://opendata.inrae.fr/PLP/790
top concept of: PLP