RDF description of
primary topic: garluche

garluche
type: Concept
subject: Pedology @en
subject: Pédologie
modified: 2020-07-03T10:24:40.403+02:00
definition: Horizons d'accumulation ferrugineux très durcis pouvant faire obstacle au labour ou à l'enracinement des plantes. (Source : INRA)
in scheme: PLP
note: Terme vernaculaire du Sud-Ouest de la France. (Source : INRA)
preferred label: ironstone @en
related: http://opendata.inrae.fr/PLP/429
related: http://opendata.inrae.fr/PLP/466
related: http://opendata.inrae.fr/PLP/425
top concept of: PLP