RDF description of
primary topic: gélif

gélif
type: Concept
subject: Geology @en
subject: Pedology @en
subject: Géologie
subject: Pédologie
definition: Qualifie une roche poreuse ou un élément grossier poreux et donc très sensibles à la gélifraction (craies, marnes, calcaires crayeux, etc.). (Source : INRA)
in scheme: PLP
preferred label: easily cracked by frost @en
top concept of: PLP