gibbsite
type: Concept
subject: Pedology @en
subject: Pédologie
definition: Hydroxyde d'aluminium, de formule Al(OH)3, constituant secondaire caractéristique des bauxites et de la plupart des sols ferrallitiques. (Source : INRA)
in scheme: PLP
note: La couche octaédrique des feuillets de certains minéraux argileux est dite couche ou réseau gibbsitique car elle a la même composition que la gibbsite. (Source : INRA)
related: http://opendata.inrae.fr/PLP/104
top concept of: PLP

RDF description of
primary topic: gibbsite