altération
type: Concept
subject: Geology @en
subject: Pedology @en
subject: Géologie
subject: Pédologie
definition: Ensemble des phénomènes de transformation chimique ou de dissolution des minéraux primaires dans les roches et dans les sols. (Source : INRA)
in scheme: PLP
note: S'oppose à désagrégation. (Source : INRA)
preferred label: weathering @en
related: http://opendata.inrae.fr/PLP/43
related: http://opendata.inrae.fr/PLP/619
related: http://opendata.inrae.fr/PLP/41
related: http://opendata.inrae.fr/PLP/620
related: http://opendata.inrae.fr/PLP/688
related: http://opendata.inrae.fr/PLP/613
top concept of: PLP

RDF description of
primary topic: altération