RDF description of
primary topic: gleysols

gleysols
type: Concept
subject: Pedology @en
subject: Pédologie
definition: Groupe de sols de référence caractérisés par un engorgement et un caractère réduit temporaires ou permanents à faible profondeur et dont la partie supérieure du solum est bariolée (en cas d'aération temporaire) ou présente des couleurs reflétant un milieu réduit (blanc à noir ou bleuâtre à verdâtre) (WRB). (Source : INRA)
in scheme: PLP
note: Les propriétés gleyiques apparaissent lorsque le solum est complètement saturé par une nappe phréatique durant une période suffisamment longue pour que des conditions réductrices interviennent, soit quelques jours sous les tropiques à quelques semaines sous les autres régions. Les propriétés oximorphes s'appliquent à des horizons où les conditions réductrices et oxydantes alternent telle la frange capillaire et les horizons supérieurs de sols à nappe phréatique fluctuante. (Source : INRA)
related: http://opendata.inrae.fr/PLP/782
related: http://opendata.inrae.fr/PLP/783
related: http://opendata.inrae.fr/PLP/786
top concept of: PLP