RDF description of
primary topic: glosses

glosses
type: Concept
subject: Pedology @en
subject: Pédologie
alternative label: langues
definition: Pénétrations d'un horizon dans un autre horizon sous-jacent sous la forme d'ondulations plus ou moins régulières mais beaucoup plus profondes que larges. (Source : INRA)
in scheme: PLP
preferred label: tongue @en
related: http://opendata.inrae.fr/PLP/261
related: http://opendata.inrae.fr/PLP/527
related: http://opendata.inrae.fr/PLP/694
related: http://opendata.inrae.fr/PLP/415
top concept of: PLP