RDF description of
primary topic: glossique

glossique
type: Concept
subject: Pedology @en
subject: Pédologie
definition: Qualifie une limite d'horizon ayant la forme de glosses (ou de langues). (Source : INRA)
in scheme: PLP
note: Dans le Référentiel Pédologique, glossique qualifie un certain type de dégradation observable notamment dans les Luvisols Dégradés au contact entre horizons E et horizons BT. Dans la base de référence mondiale pour les ressources en sols (WRB), ce terme qualifie un solum montrant des langues d'horizons mollique ou umbrique pénétrant dans un horizon B sous-jacent ou dans un saprolite. (Source : INRA)
preferred label: glossic @en
related: http://opendata.inrae.fr/PLP/261
related: http://opendata.inrae.fr/PLP/551
related: http://opendata.inrae.fr/PLP/414
top concept of: PLP