gonflement
type: Concept
subject: Pedology @en
subject: Pédologie
definition: Propriété de certains types de minéraux argileux (et donc de matériaux ou d'horizons constitués majoritairement par ces minéraux) de gonfler fortement par adsorption d'eau entre les feuillets, mais aussi par emprisonnement dans une sorte de réseau spongieux (jusqu'à dix fois leur poids d'eau). (Source : INRA)
in scheme: PLP
preferred label: swelling @en
related: http://opendata.inrae.fr/PLP/1001
related: http://opendata.inrae.fr/PLP/365
related: http://opendata.inrae.fr/PLP/78
related: http://opendata.inrae.fr/PLP/863
top concept of: PLP

RDF description of
primary topic: gonflement