RDF description of
primary topic: grands ensembles de références

grands ensembles de références
type: Concept
subject: Pedology @en
subject: Pédologie
alternative label: GER
definition: Ensembles typologiques dont le concept central est bien défini et reconnu par nombre de classifications dans le monde. (Source : INRA)
in scheme: PLP
note: Les GER correspondent à des chapitres du Référentiel pédologique et regroupent plusieurs Références qui ont de nombreux caractères communs et qui, par exemple, montrent les mêmes horizons de référence. Leurs frontières avec les autres Grands Ensembles voisins peuvent être assez floues. La présentation de ces caractères communs et de ces horizons communs dans un même chapitre répond donc surtout à une nécessité rédactionnelle et didactique. Ainsi sept Références caractérisées par l'existence d'un processus de podzolisation sont rassemblées dans un même GER, celui des podzosols. (Source : INRA)
preferred label: major sets of references @en
top concept of: PLP