altérite
type: Concept
subject: Geology @en
subject: Pedology @en
subject: Géologie
subject: Pédologie
modified: 2020-08-27T15:22:29.149+02:00
alternative label: saprolithe
alternative label: regolith @en
definition: Formation résiduelle provenant de l'altération météorique d'une roche. (Source : INRA)
in scheme: PLP
note: Si l'altérite a conservé l'aspect des structures originelles (grain, texture, fissuration) on parlera d'" isaltérite ". Si l'altérite a subi des transformations volumiques (tassements, dissolutions) et/ou minéralogiques importantes (argilisation ou autres néogenèses minérales) on parlera d'" allotérite ". (Source : INRA)
preferred label: alterite @en
related: http://opendata.inrae.fr/PLP/71
related: http://opendata.inrae.fr/PLP/70
related: http://opendata.inrae.fr/PLP/460
related: http://opendata.inrae.fr/PLP/40
related: http://opendata.inrae.fr/PLP/531
related: http://opendata.inrae.fr/PLP/833
top concept of: PLP

RDF description of
primary topic: altérite