RDF description of
primary topic: granulométrie

granulométrie
type: Concept
subject: Pedology @en
subject: Agronomie
subject: Pédologie
subject: Agronomy @en
modified: 2020-08-27T15:05:42.464+02:00
alternative label: composition granulométrique
definition: Expression pondérale de la répartition des particules minérales selon leur grosseur (terre fine et éléments grossiers). (Source : INRA)
in scheme: PLP
note: Une fois admises les limites de différentes classes de dimensions des particules (fractions granulométriques ; i.e. argiles, limons, sables, graviers, cailloux), c'est la répartition des particules d'un échantillon de sol selon ces différentes fractions. La granulométrie de la terre fine est déterminée au laboratoire après destruction des ciments et annulation des forces de cohésion qui agrègent les particules élémentaires ; elle est exprimée par des pourcentages d'argiles, limons et sables, et peut être positionnée sur des triangles de texture. (Source : INRA)
preferred label: particle size distribution @en
related: http://opendata.inrae.fr/PLP/394
related: http://opendata.inrae.fr/PLP/984
related: http://opendata.inrae.fr/PLP/191
top concept of: PLP