RDF description of
primary topic: graveleux

graveleux
type: Concept
subject: Pedology @en
subject: Pédologie
definition: Qualifie un horizon ou un solum constitué uniquement ou majoritairement de graviers. (Source : INRA)
in scheme: PLP
preferred label: gravelly @en
top concept of: PLP