RDF description of
primary topic: graviers

graviers
type: Concept
subject: Pedology @en
subject: Pédologie
definition: Eléments grossiers de dimensions comprises entre 2 et 20 mm. (Source : INRA)
in scheme: PLP
preferred label: gravels @en
top concept of: PLP