RDF description of
primary topic: grisols

grisols
type: Concept
subject: Pedology @en
subject: Pédologie
definition: Catégorie de sols caractérisés par un épisolum humifère à caractère clinohumique et des pH faiblement acides, formés dans des zones à climats tempérés continentaux, intermédiaires entre la zone des forêts feuillues et celle de la steppe (Référentiel Pédologique). (Source : INRA)
in scheme: PLP
note: L'activité biologique y est forte et peut se marquer par des coprolithes (dans les horizons supérieurs), de nombreux tubules et chambres biologiques et par des crotovinas de grandes dimensions en profondeur. A la différence des chernosols, l'altération géochimique des minéraux primaires est assez forte, on observe notamment une dégradation active à la surface des agrégats dans certains horizons, dénudant les particules sableuses d'où des teintes gris clair. Les grisols correspondent aux greyzems de la Légende FAO (désormais intégrés aux phaeozems de la Base de référence mondiale pour les ressources en sols) et aux sols gris forestiers des anciens auteurs russes. (Source : INRA)
top concept of: PLP