RDF description of
primary topic: gypse

gypse
type: Concept
subject: Geology @en
subject: Pedology @en
subject: Géologie
subject: Pédologie
definition: Sulfate de calcium hydraté (de formule CaSO4, 2 H2O), présent initialement comme minéral primaire dans certaines roches sédimentaires. (Source : INRA)
in scheme: PLP
note: Facilement soluble dans l'eau, le gypse est dissous, transporté à l'état de solutions dans les nappes et dans les couvertures pédologiques ; il peut aussi être repris sous forme solide et transporté par le vent. On le trouve sous diverses formes secondaires (fines aiguilles, petits cristaux) dans beaucoup de sols des zones à climat aride ou semi-aride où presque tous les solums présentent des manifestations gypseuses pouvant aller de seulement quelques traces de sulfates dans les solutions du sol jusqu'à de puissantes croûtes polygonales. (Source : INRA)
preferred label: gypsum @en
related: http://opendata.inrae.fr/PLP/144
related: http://opendata.inrae.fr/PLP/434
related: http://opendata.inrae.fr/PLP/435
related: http://opendata.inrae.fr/PLP/889
related: http://opendata.inrae.fr/PLP/469
top concept of: PLP