RDF description of
primary topic: gypseux

gypseux
type: Concept
subject: Pedology @en
subject: Pédologie
definition: Qualifie un horizon ou un solum qui contient du gypse. (Source : INRA)
in scheme: PLP
preferred label: gypseous @en
top concept of: PLP