gypsique
type: Concept
subject: Pedology @en
subject: Pédologie
definition: Qualifie un solum, autre qu'un gypsosol, présentant une accumulation de gypse en profondeur (Référentiel Pédologique). (Source : INRA)
in scheme: PLP
preferred label: gypsic @en
related: http://opendata.inrae.fr/PLP/469
top concept of: PLP

RDF description of
primary topic: gypsique