RDF description of
primary topic: gypsisols

gypsisols
type: Concept
subject: Pedology @en
subject: Pédologie
definition: Groupe de sols de référence caractérisés par la présence d'un horizon gypsique, c'est-à-dire d'un horizon d'accumulation de gypse secondaire (WRB). (Source : INRA)
in scheme: PLP
note: Les sources de gypse secondaire sont les altérations de roches ou de poussières gypseuses et les nappes phréatiques chargées en sulfate de calcium. Les gypsisols sont observés principalement sous climats arides. (Source : INRA)
preferred label: Gypsisols @en
related: http://opendata.inrae.fr/PLP/431
top concept of: PLP