RDF description of
primary topic: halloysite

halloysite
type: Concept
subject: Mineralogy @en
subject: Pedology @en
subject: Minéralogie
subject: Pédologie
definition: Minéral argileux de type 1/1, aux feuillets semblables à ceux de la kaolinite mais séparés par une couche de molécules d'eau (d'où une équidistance des feuillets à 10,1 angströms) et à empilement désordonné. (Source : INRA)
in scheme: PLP
note: Ce minéral résulte de la monosiallitisation et se trouve donc principalement dans les sols ferrallitiques et les nitosols. (Source : INRA)
related: http://opendata.inrae.fr/PLP/642
related: http://opendata.inrae.fr/PLP/877
related: http://opendata.inrae.fr/PLP/625
top concept of: PLP