RDF description of
primary topic: halomorphe

halomorphe
type: Concept
subject: Pedology @en
subject: Pédologie
definition: Qualifie un sol dont les propriétés sont dominées par l'abondance des sels neutres ou alcalins, principalement les chlorures de Na et/ou Mg. (Source : INRA)
in scheme: PLP
note: Terme désuet. (Source : INRA)
preferred label: halomorphic @en
top concept of: PLP