RDF description of
primary topic: halophile

halophile
type: Concept
subject: Pedology @en
subject: Ecology @en
subject: Pédologie
subject: Écologie
definition: Qualifie une espèce végétale ou un groupement d'espèces qui tolère, jusqu'à un certain point, la présence de chlorure de sodium dans le sol. (Source : INRA)
in scheme: PLP
preferred label: halophilous @en
top concept of: PLP