RDF description of
primary topic: aluandosols

aluandosols
type: Concept
subject: Pedology @en
subject: Pédologie
definition: Catégories d'andosols très acides où l'aluminium complexé par des acides organiques domine sur l'aluminium des minéraux allophaniques (Référentiel Pédologique). (Source : INRA)
in scheme: PLP
note: La fertilisation de ces sols est très difficile. (Source : INRA)
related: http://opendata.inrae.fr/PLP/56
top concept of: PLP