hémi-organique
type: Concept
subject: Pedology @en
subject: Pédologie
definition: Qualifie un horizon très humifère, mais non holorganique, contenant plus de 8 g de carbone organique pour 100 g (Référentiel Pédologique). (Source : INRA)
in scheme: PLP
preferred label: hemi-organic @en
related: http://opendata.inrae.fr/PLP/444
related: http://opendata.inrae.fr/PLP/664
top concept of: PLP

RDF description of
primary topic: hémi-organique