RDF description of
primary topic: hétérogénéité

hétérogénéité
type: Concept
subject: Pedology @en
subject: Pédologie
definition: Propriété des couvertures pédologiques, dans les trois dimensions de l'espace et observable à toutes les échelles d'investigation (du micromètre au kilomètre). (Source : INRA)
in scheme: PLP
note: C'est cette hétérogénéité qui rend si difficile leur échantillonnage, leur modélisation et leur spatialisation. (Source : INRA)
preferred label: heterogeneity @en
related: http://opendata.inrae.fr/PLP/160
related: http://opendata.inrae.fr/PLP/456
related: http://opendata.inrae.fr/PLP/996
top concept of: PLP