RDF description of
primary topic: histosols

histosols
type: Concept
subject: Pedology @en
subject: Pédologie
definition: Types de sols composés de matières organiques et d'eau, dont le solum se construit à partir de débris végétaux morts qui se transforment lentement en conditions d'anaérobiose en raison de son engorgement permanent ou quasi-permanent. (Source : INRA)
in scheme: PLP
note: Un histosol est constitué presque exclusivement d'horizons holorganiques H. Les histosols forment un GER du Référentiel Pédologique et un GSR de la Base de référence mondiale pour les ressources en sols (WRB). (Source : INRA)
related: http://opendata.inrae.fr/PLP/470
related: http://opendata.inrae.fr/PLP/659
related: http://opendata.inrae.fr/PLP/583
related: http://opendata.inrae.fr/PLP/872
related: http://opendata.inrae.fr/PLP/971
related: http://opendata.inrae.fr/PLP/975
top concept of: PLP