RDF description of
primary topic: holorganique

holorganique
type: Concept
subject: Pedology @en
subject: Pédologie
definition: Qualifie un horizon ou un sol entièrement constitué de matières organiques, humifiées ou non, pratiquement sans matière minérale (horizons organiques O et horizons histiques H)(Référentiel Pédologique). (Source : INRA)
in scheme: PLP
note: Deux seuils analytiques sont proposés : plus de 30 g de carbone organique pour 100 g ou perte au feu à 600 °C supérieure à 50 g/100 g. (Source : INRA)
preferred label: holorganic @en
related: http://opendata.inrae.fr/PLP/440
related: http://opendata.inrae.fr/PLP/664
top concept of: PLP