RDF description of
primary topic: horizon A de juxtaposition

horizon A de juxtaposition
type: Concept
subject: Pedology @en
subject: Pédologie
definition: Type d'horizon A correspondant aux épisolums à faible activité biologique, sans activité notable de vers de terre (podzosols) (Référentiel Pédologique). (Source : INRA)
in scheme: PLP
note: Le milieu ne permet pas l'insolubilisation dans cet horizon A des molécules solubles qui peuvent participer alors à l'acidocomplexolyse. Il n'y a pas d'humine d'insolubilisation, ni organo-argilique ; l'humine microbienne est peu abondante, les complexes argilohumiques rares ou absents. La matière organique est sous forme d'humine héritée majoritaire (digestion quasi nulle des pigments bruns par la faune du sol), sous forme de boulettes fécales juxtaposées aux particules minérales. (Source : INRA)
preferred label: juxtaposition A horizon @en
related: http://opendata.inrae.fr/PLP/623
top concept of: PLP