RDF description of
primary topic: horizon B argilique

horizon B argilique
type: Concept
subject: Pedology @en
subject: Pédologie
definition: Horizon diagnostique de la Légende de la carte mondiale des sols FAO-UNESCO (1975), caractérisé par une importante accumulation d'argiles illuviales. (Source : INRA)
in scheme: PLP
note: Concept abandonné dans la Base de référence mondiale pour les ressources en sols (WRB) au profit de l'horizon argique. (Source : INRA)
preferred label: argillic B horizon @en
related: http://opendata.inrae.fr/PLP/447
top concept of: PLP