horizon cambique
type: Concept
subject: Pedology @en
subject: Pédologie
definition: Horizon diagnostique caractérisé par une structure pédologique nette et par des couleurs indiquant un degré d'altération modéré (WRB). (Source : INRA)
in scheme: PLP
note: Cet horizon correspond assez bien à la notion d' "horizon structural" du Référentiel pédologique. (Source : INRA)
preferred label: cambic horizon @en
top concept of: PLP

RDF description of
primary topic: horizon cambique