horizons
type: Concept
subject: Pedology @en
subject: Pédologie
definition: Couches superposées d'une couverture pédologique, d'épaisseur variable, paraissant homogènes à l'œil nu, qui ont des propriétés différentes les unes des autres. (Source : INRA)
in scheme: PLP
note: L'horizon est le niveau d'investigation le plus commode pour décrire, échantillonner et définir les couvertures pédologiques. Les couvertures pédologiques montrent en général des différenciations selon un axe vertical, d'où la notion très ancienne d'horizon. Dans une fosse, les horizons résultant de ce découpage sont des volumes, paraissant macroscopiquement homogènes, des sous-ensembles de la couverture pédologique étudiée. L'horizon est le niveau d'investigation le plus commode pour décrire, échantillonner et définir les couvertures pédologiques. Les pédologues utilisent couramment les " horizons-concepts " qui sont le résultat de l'interprétation de certains caractères morphologiques propres à l'horizon étudié et que nous considérons comme typiquement associés à des processus pédogénétiques, mais qui résultent aussi de la prise en compte des autres horizons et de divers éléments de l'environnement pédologique. Ces " horizons-concepts " sont l'objet d'une typologie morphogénétique et d'un langage synthétique auquel sont associés des symboles : H, O, A, E, S, BT... Dans le Référentiel Pédologique, ils sont nommés horizons de référence. (Source : INRA)
preferred label: soil horizons @en
related: http://opendata.inrae.fr/PLP/869
related: http://opendata.inrae.fr/PLP/271
related: http://opendata.inrae.fr/PLP/551
related: http://opendata.inrae.fr/PLP/463
related: http://opendata.inrae.fr/PLP/442
related: http://opendata.inrae.fr/PLP/885
related: http://opendata.inrae.fr/PLP/299
related: http://opendata.inrae.fr/PLP/787
related: http://opendata.inrae.fr/PLP/259
related: http://opendata.inrae.fr/PLP/789
top concept of: PLP

RDF description of
primary topic: horizons