horizons A
type: Concept
subject: Pedology @en
subject: Pédologie
definition: Horizons organo-minéraux ou hémiorganiques, c'est-à-dire contenant en mélange de la matière organique et de la matière minérale, situés à la base des horizons holorganiques lorsqu'ils existent, sinon à la partie supérieure du solum (Référentiel Pédologique). (Source : INRA)
in scheme: PLP
note: Les horizons A présentent une structuration pédologique généralisée d'origine biologique (action de la faune et/ou des racines et/ou des matières organiques). Ils présentent obligatoirement l'un des trois modes majeurs d'incorporation et de liaison de la matière organique à la matière minérale suivants : horizon A biomacrostructuré, horizon A d'insolubilisation ou horizon A de juxtaposition. Selon les conditions de saturation du complexe d'échange ou la dominance de tel ou tel composant (calcaire, dolomie), le Référentiel Pédologique distingue et définit douze sous-types d'horizons A. Les horizons A sous végétation permanente (forêts, prairies, pelouses, alpages) sont le lieu de retour des débris des organes aériens des plantes et de leurs composants (cycle biogéochimique des éléments majeurs et traces) et l'interface entre lithosphère et atmosphère (retombées atmosphériques). (Source : INRA)
preferred label: A horizons @en
related: http://opendata.inrae.fr/PLP/451
related: http://opendata.inrae.fr/PLP/331
related: http://opendata.inrae.fr/PLP/781
related: http://opendata.inrae.fr/PLP/445
related: http://opendata.inrae.fr/PLP/113
related: http://opendata.inrae.fr/PLP/388
top concept of: PLP

RDF description of
primary topic: horizons A