RDF description of
primary topic: horizons BT

horizons BT
type: Concept
subject: Pedology @en
subject: Pédologie
alternative label: horizon argilluvial
definition: Horizons qui contiennent en abondance des argiles phylliteuses illuviales et qui se forment en relation avec un horizon éluvial lequel se trouve au-dessus de lui dans le même solum ou plus haut sur un versant (Référentiel Pédologique). (Source : INRA)
in scheme: PLP
note: Les propriétés texturales, structurales et de porosité d'un horizon BT (anciennement nommé B " textural " et codé Bt) sont grandement déterminées par l'abondance des particules argileuses illuviées (le plus souvent sous la forme de revêtements sur les faces des agrégats ou sur les faces de vides). Aux particules argileuses peuvent être associées d'autres substances, notamment des oxydes de fer et des matières organiques. Un horizon BT peut se trouver en surface si le solum a été partiellement tronqué. (Source : INRA)
preferred label: BT horizons @en
related: http://opendata.inrae.fr/PLP/507
related: http://opendata.inrae.fr/PLP/82
related: http://opendata.inrae.fr/PLP/815
related: http://opendata.inrae.fr/PLP/506
related: http://opendata.inrae.fr/PLP/73
related: http://opendata.inrae.fr/PLP/576
related: http://opendata.inrae.fr/PLP/4
top concept of: PLP