aluminium
type: Concept
subject: Geology @en
subject: Pedology @en
subject: Géologie
subject: Pédologie
definition: Élément chimique majeur de la croûte terrestre (environ 8,1 %) entrant dans la composition de nombreux silicates dits aluminosilicates (feldspaths, micas, minéraux argileux, allophanes, imogolite). (Source : INRA)
in scheme: PLP
note: Dans certains sols et paléosols tropicaux (bauxite), il se trouve également sous la forme de gibbsite - Al(OH)3 - et de boehmite - Al O(OH). (Source : INRA)
related: http://opendata.inrae.fr/PLP/549
related: http://opendata.inrae.fr/PLP/46
top concept of: PLP

RDF description of
primary topic: aluminium