horizons C
type: Concept
subject: Pedology @en
subject: Pédologie
definition: Horizons minéraux de profondeur qui diffèrent des couches M ou R en ce que leurs constituants ont subi, dans toute leur masse, une fragmentation importante et/ou une certaine altération météorique (Référentiel Pédologique). (Source : INRA)
in scheme: PLP
note: Ils diffèrent des horizons A, E, S, BT, G, g, etc. car il n'ont pas acquis de structuration pédologique généralisée et conservent en grande partie leur structure lithologique originelle (isaltérite, allotérite). Pour la Base de référence mondiale pour les ressources en sols (WRB), il s'agit d'horizons ou couches, à l'exclusion de roches dures, qui sont peu affectés par des processus pédogénétiques et qui n'ont pas les propriétés des horizons H, O, A, E ou B. (Source : INRA)
preferred label: C horizons @en
related: http://opendata.inrae.fr/PLP/41
top concept of: PLP

RDF description of
primary topic: horizons C