horizons cailloutiques
type: Concept
subject: Pedology @en
subject: Pédologie
alternative label: cobbly horizons @en
alternative label: horizons Xc
definition: Horizons présentant un taux d'éléments grossiers supérieur à 60 % par rapport à la terre brute totale (expression en pondéral) et, en même temps, un taux de cailloux, de pierres et de blocs supérieur à 50 % avec cailloux dominants (Référentiel Pédologique 2007). (Source : INRA)
in scheme: PLP
preferred label: Xc horizons @en
related: http://opendata.inrae.fr/PLP/473
related: http://opendata.inrae.fr/PLP/675
related: http://opendata.inrae.fr/PLP/700
related: http://opendata.inrae.fr/PLP/468
top concept of: PLP

RDF description of
primary topic: horizons cailloutiques