horizons éluviaux
type: Concept
subject: Pedology @en
subject: Pédologie
alternative label: horizons E
alternative label: E horizons @en
definition: Horizons organo-minéraux, appauvris en fer et/ou en minéraux argileux phylliteux et/ou en aluminium, avec concentration corrélative en minéraux résistants (Référentiel Pédologique). (Source : INRA)
in scheme: PLP
note: Ce sont des horizons d'éluviation (par entraînement vertical, oblique ou latéral) à laquelle s'ajoute souvent une dégradation géochimique. Directement mobiles ou libérées par altération, les matières quittent ces horizons sous forme de solutions ou de suspensions et transitent vers des horizons plus profonds et/ou hors du solum. Les horizons E contiennent beaucoup moins de carbone organique que les horizons A ou L susjacents. Ils sont nettement moins argileux, moins bien structurés et moins colorés que les horizons BT, BP ou S sous-jacents ou correspondant latéralement. Certains horizons E sont dits "albiques" lorsque la couleur très claire de l'horizon est déterminée par celle des particules primaires de limons et de sables et non plus par des revêtements sur ces particules. (Source : INRA)
preferred label: eluvial horizons @en
related: http://opendata.inrae.fr/PLP/261
related: http://opendata.inrae.fr/PLP/718
related: http://opendata.inrae.fr/PLP/322
related: http://opendata.inrae.fr/PLP/321
related: http://opendata.inrae.fr/PLP/767
top concept of: PLP

RDF description of
primary topic: horizons éluviaux