RDF description of
primary topic: horizons fersiallitiques

horizons fersiallitiques
type: Concept
subject: Pedology @en
subject: Pédologie
alternative label: FS horizons @en
alternative label: horizons FS
definition: Horizons le plus souvent argileux, rouges et à structure polyédrique anguleuse stable, caractéristiques de la pédogenèse fersiallitique. (Source : INRA)
in scheme: PLP
preferred label: fersiallitic horizons @en
related: http://opendata.inrae.fr/PLP/683
related: http://opendata.inrae.fr/PLP/384
related: http://opendata.inrae.fr/PLP/373
related: http://opendata.inrae.fr/PLP/635
related: http://opendata.inrae.fr/PLP/116
related: http://opendata.inrae.fr/PLP/458
top concept of: PLP