aluminium échangeable
type: Concept
subject: Pedology @en
subject: Agronomie
subject: Pédologie
subject: Agronomy @en
definition: Forme échangeable de l'aluminium (Al3+) pouvant se fixer sur le complexe d'échange et génératrice d'acidité. (Source : INRA)
in scheme: PLP
note: L'aluminium échangeable n'existe qu'à des pH eau inférieurs à 5,5. S'ils sont trop abondants, les cations Al3+ peuvent devenir toxiques pour de nombreuses plantes : c'est la toxicité aluminique. (Source : INRA)
preferred label: exchangeable aluminium @en
related: http://opendata.inrae.fr/PLP/45
related: http://opendata.inrae.fr/PLP/8
top concept of: PLP

RDF description of
primary topic: aluminium échangeable