horizons histiques
type: Concept
subject: Pedology @en
subject: Pédologie
alternative label: horizons H
definition: Horizons holorganiques, formés en milieu saturé par l'eau durant des périodes prolongées (plus de 6 mois par an) et composés principalement à partir de débris de végétaux hygrophiles ou sub-aquatiques (Référentiel Pédologique). (Source : INRA)
in scheme: PLP
note: En raison de leur constitution holorganique, des méthodes analytiques spécifiques doivent être employées pour les caractériser. Selon le degré de décomposition du matériel végétal, on distingue trois types d'horizons H : - horizons H " fibriques " (codés Hf) : faible décomposition des fibres, structures végétales facilement identifiables ; - horizons H " mésiques " (codés Hm) : la décomposition du matériel végétal est moyenne à forte ; les structures végétales sont difficilement identifiables ; - horizons H "sapriques " (codés Hs) : décomposition presque totale à totale du matériel végétal ; les structures végétales ne sont plus discernables. Le Référentiel Pédologique distingue également les horizons H " assainis " (codés Ha) et des horizons H " labourés " (codés LH). Ils sont tous formés de matières organiques très décomposées et de couleur foncée. Un abaissement du niveau de la nappe, avec mise en culture (horizon LH) ou sans (horizon Ha), entraîne une forte structuration. (Source : INRA)
preferred label: histic horizons @en
related: http://opendata.inrae.fr/PLP/519
related: http://opendata.inrae.fr/PLP/472
related: http://opendata.inrae.fr/PLP/443
related: http://opendata.inrae.fr/PLP/975
related: http://opendata.inrae.fr/PLP/942
top concept of: PLP

RDF description of
primary topic: horizons histiques