RDF description of
primary topic: horizons organiques

horizons organiques
type: Concept
subject: Pedology @en
subject: Pédologie
alternative label: horizons O
definition: Horizons holorganiques, formés en conditions aérobies, constitués principalement de débris ou fragments végétaux morts (feuilles, aiguilles, racines, matériels ligneux) plus ou moins transformés et toujours situés à la partie supérieure des solums, au-dessus des autres horizons ou couches (Référentiel Pédologique). (Source : INRA)
in scheme: PLP
note: Trois types d'horizons organiques doivent être distingués qui se différencient par l'état moyen de transformation des débris végétaux lié à l'activité biologique : - les horizons OL : constitués de débris foliaires non ou peu évolués et de débris ligneux. La forme originelle des débris est aisément reconnaissable à l'œil nu ; - les horizons OF : formés de résidus végétaux, surtout d'origine foliaire, plus ou moins fragmentés, reconnaissables à l'œil nu, en mélange avec des proportions plus ou moins grandes (moins de 70 % en recouvrement visuel) de matières organiques fines sous la forme de boulettes fécales. Les horizons OF sont souvent parcourus par un réseau racinaire fin plus ou moins abondant et par des mycéliums ; - les horizons OH : qui contiennent plus de 70 % en volume de matières organiques fines. Celles-ci sont sous forme de boulettes fécales et/ou de microdébris végétaux et mycéliens sans structure reconnaissable à l'œil nu. Ce pourcentage est évalué hors racines fines (mortes ou vivantes) qui sont souvent très abondantes. Les horizons OH se présentent comme un produit assez homogène de teinte brun rougeâtre à noire, à structure continue ou granulaire ou fibreuse. La présence de grains minéraux visibles à l'oil nu est possible. Les distinctions entre OL, OF et OH sont indispensables car elles servent à la définition des formes d'humus. (Source : INRA)
preferred label: O horizons @en
related: http://opendata.inrae.fr/PLP/627
related: http://opendata.inrae.fr/PLP/470
related: http://opendata.inrae.fr/PLP/959
related: http://opendata.inrae.fr/PLP/661
related: http://opendata.inrae.fr/PLP/120
related: http://opendata.inrae.fr/PLP/565
related: http://opendata.inrae.fr/PLP/453
related: http://opendata.inrae.fr/PLP/388
related: http://opendata.inrae.fr/PLP/634
top concept of: PLP