horizons podzoliques
type: Concept
subject: Pedology @en
subject: Pédologie
alternative label: horizons BP
definition: Horizons caractéristiques et obligatoires des podzosols, caractérisés par une accumulation absolue de produits amorphes constitués par des matières organiques et de l'aluminium, avec ou non du fer (Référentiel Pédologique). (Source : INRA)
in scheme: PLP
note: Les horizons BP présentent toujours les caractères suivants : - une teinte à l'état humide 7,5 YR selon le code Munsell ou plus rouge ; - des taux d'aluminium et de fer extractibles à l'oxalate d'ammonium plus élevés que dans les horizons sus-jacents A ou E ; - une fraction majoritaire de matières organiques extractibles au pyrophosphate de sodium ; dans cette fraction extractible, les acides fulviques sont essentiellement de type polyphénolique. Ils présentent souvent les caractères suivants : - une microstructure pelliculaire, les revêtements étant constitués de matière organique amorphe associée à l'aluminium et, éventuellement, au fer ; - une cimentation continue d'une partie de l'horizon par des constituants amorphes organiques associés à l'aluminium et, éventuellement, au fer. La morphologie et les caractéristiques analytiques des horizons BP sont susceptibles de varier largement. On distingue notamment des horizons BP cimentés (alios, ortstein) et des horizons BP meubles ou friables. Certains horizons BP (codés BPh) ont une teneur élevée en carbone, relativement aux teneurs en Al et Fe extractibles, d'autres (codés BPs ; s pour sesquioxydes) ont une teneur plus faible en carbone et Al et Fe extractibles sont alors dominants. Ces deux types d'horizons BP peuvent exister dans un même solum, dans ce cas l'horizon BPh est situé au-dessus de l'horizon BPs. (Source : INRA)
preferred label: BP horizons @en
related: http://opendata.inrae.fr/PLP/726
related: http://opendata.inrae.fr/PLP/728
related: http://opendata.inrae.fr/PLP/727
related: http://opendata.inrae.fr/PLP/176
related: http://opendata.inrae.fr/PLP/729
related: http://opendata.inrae.fr/PLP/466
related: http://opendata.inrae.fr/PLP/4
related: http://opendata.inrae.fr/PLP/731
related: http://opendata.inrae.fr/PLP/179
related: http://opendata.inrae.fr/PLP/33
top concept of: PLP

RDF description of
primary topic: horizons podzoliques