RDF description of
primary topic: horizons rédoxiques

horizons rédoxiques
type: Concept
subject: Pedology @en
subject: Pédologie
modified: 2020-07-06T11:33:34.310+02:00
definition: Horizons dont la morphologie résulte de la succession, dans le temps, de processus de réduction avec mobilisation du fer (périodes de saturation en eau) et d'oxydation avec immobilisation du fer (périodes de non saturation)(Référentiel Pédologique). (Source : INRA)
in scheme: PLP
note: Ils sont caractérisés par une répartition du fer très hétérogène : juxtaposition de volumes clairs appauvris en fer et de volumes enrichis en fer (taches rouille ou amas et nodules noirs). Ces ségrégations du fer sont permanentes et visibles quel que soit l'état d'humidité de l'horizon. Les immobilisations se maintenant lorsque le sol est de nouveau saturé, elles tendent ainsi à former peu à peu des accumulations localisées de fer. (Source : INRA)
preferred label: redoxic horizons @en
related: http://opendata.inrae.fr/PLP/935
related: http://opendata.inrae.fr/PLP/782
related: http://opendata.inrae.fr/PLP/499
related: http://opendata.inrae.fr/PLP/477
related: http://opendata.inrae.fr/PLP/783
related: http://opendata.inrae.fr/PLP/673
related: http://opendata.inrae.fr/PLP/761
related: http://opendata.inrae.fr/PLP/852
related: http://opendata.inrae.fr/PLP/842
related: http://opendata.inrae.fr/PLP/589
related: http://opendata.inrae.fr/PLP/669
top concept of: PLP