RDF description of
primary topic: horizons réductiques

horizons réductiques
type: Concept
subject: Pedology @en
subject: Pédologie
alternative label: G horizons @en
alternative label: horizons G
definition: Horizons dont la morphologie résulte de la prédominance des processus de réduction et de mobilisation du fer suite à des engorgements permanents ou quasi permanents (Référentiel Pédologique). (Source : INRA)
in scheme: PLP
note: Dans les horizons réductiques, la répartition du fer est plutôt homogène. Leur morphologie varie au cours de l'année en fonction de la persistance ou du caractère saisonnier de la saturation (battement de nappe profonde) qui les génère. D'où la distinction entre horizons réductiques sensu stricto (codés Gr) et ceux temporairement réoxydés (codés Go). Les premiers sont caractérisés par leur couleur qui peut être soit uniformément bleuâtre à verdâtre, soit uniformément blanche à noire ou grisâtre. Dans le cas des horizons Go la saturation par l'eau est interrompue périodiquement. Des taches de teinte rouille sont observables pendant les périodes de non saturation, au contact des vides, des racines, sur les faces de certains agrégats. Ces taches disparaissent quand l'horizon est de nouveau saturé d'eau. Lorsque la porosité et les conditions hydrologiques permettent le renouvellement de l'eau en excès, ces horizons s'appauvrissent progressivement en fer. Une déferrification complète peut parfois intervenir, d'où le blanchiment de l'horizon (horizon G albique). (Source : INRA)
preferred label: reductic horizons @en
related: http://opendata.inrae.fr/PLP/784
related: http://opendata.inrae.fr/PLP/499
related: http://opendata.inrae.fr/PLP/412
related: http://opendata.inrae.fr/PLP/786
related: http://opendata.inrae.fr/PLP/476
related: http://opendata.inrae.fr/PLP/785
related: http://opendata.inrae.fr/PLP/852
related: http://opendata.inrae.fr/PLP/842
top concept of: PLP