horizons siliciques
type: Concept
subject: Pedology @en
subject: Pédologie
alternative label: horizons Si
definition: Horizons subsuperficiels cimentés par de la silice en quantité importante, voire dominante, à tel point que des fragments de l'horizon séché à l'air ne se délitent pas après immersion prolongée dans l'eau ou dans l'acide chlorhydrique (Référentiel Pédologique). (Source : INRA)
in scheme: PLP
note: Le degré de cimentation est variable suivant l'accumulation de silice. Selon que les formes des accumulations sont discontinues ou continues et faiblement indurées, ou bien continues et indurées, on distingue les horizons siliciques (codés Si) et les horizons pétrosiliciques ou duripans (codés Sim). (Source : INRA)
preferred label: Si horizons @en
related: http://opendata.inrae.fr/PLP/859
related: http://opendata.inrae.fr/PLP/288
related: http://opendata.inrae.fr/PLP/523
top concept of: PLP

RDF description of
primary topic: horizons siliciques