horizons sodiques
type: Concept
subject: Pedology @en
subject: Pédologie
alternative label: horizons Na
definition: Horizons caractérisés par une forte proportion de sodium échangeable (Référentiel Pédologique). (Source : INRA)
in scheme: PLP
note: Ces horizons sont affectés également par une structure dégradée et compacte, soit totalement continue, soit grossièrement polyèdrique, prismatique ou en colonnes. Cette évolution structurale est en relation avec des conditions pédoclimatiques de plus en plus humides provoquant la mobilisation du sodium au sein des solums ou latéralement. La porosité intra-agrégats est toujours faible, non seulement en saison humide, mais aussi en saison sèche. Cette dégradation de la structure est provoquée par une teneur en sodium échangeable et hydrolysable plus ou moins élevée, mais représentant au moins 15 % de la somme des cations échangeables alcalins et alcalino-terreux. Cette teneur peut être inférieure lorsque le sodium manquant est compensé par une teneur élevée en magnésium échangeable et surtout déséquilibrée par rapport à celle du calcium. Selon la nature minéralogique des argiles présentes, une teneur en sodium inférieure à 15 % peut aussi causer des dégradations structurales. La teneur en sels solubles de ces horizons est nulle ou très faible. Notation des horizons : NaA, NaS, NaC, NaBT. (Source : INRA)
preferred label: Na horizons @en
related: http://opendata.inrae.fr/PLP/882
related: http://opendata.inrae.fr/PLP/867
top concept of: PLP

RDF description of
primary topic: horizons sodiques