horizons sulfatés
type: Concept
subject: Pedology @en
subject: Pédologie
definition: Horizons minéraux ou organo-minéraux caractérisés par un pH toujours inférieur à 3,5 après séchage et par la présence de sulfates sous forme de jarosite (taches jaune pâle) ou de sulfate d'alumine, avec une teneur en soufre total supérieure à 0,75 % (Référentiel Pédologique). (Source : INRA)
in scheme: PLP
preferred label: U horizons @en
related: http://opendata.inrae.fr/PLP/929
top concept of: PLP

RDF description of
primary topic: horizons sulfatés