horizons vertiques sphénoïdes
type: Concept
subject: Pedology @en
subject: Pédologie
alternative label: sphenoid vertic V horizons @en
alternative label: horizons V
definition: Horizons profonds présentant tous les caractères généraux des horizons à propriétés vertiques et caractérisés en outre par une structure sphénoïde et l'existence de nombreuses faces de glissement ou slickensides (Référentiel Pédologique). (Source : INRA)
in scheme: PLP
note: Cette structure est caractérisée par la présence de vastes surfaces gauchies et luisantes qui, se recoupant suivant des angles de 10 à 60° sur l'horizontale, souvent très aigus, déterminent l'existence de gros agrégats, à section voisine du losange, dont les faces sont parfois striées ou cannelées. En période de dessèchement, la partie supérieure de l'horizon V se rétracte et il apparaît des fentes et des fissures mettant en évidence une sur-structure prismatique qui se surimpose à la structure sphénoïde. Cependant la masse de l'horizon V connaît d'assez faibles variations d'humidité au cours des saisons et demeure toujours un milieu confiné. (Source : INRA)
preferred label: edge-shaped V horizons @en
related: http://opendata.inrae.fr/PLP/924
related: http://opendata.inrae.fr/PLP/1001
related: http://opendata.inrae.fr/PLP/760
related: http://opendata.inrae.fr/PLP/862
related: http://opendata.inrae.fr/PLP/546
top concept of: PLP

RDF description of
primary topic: horizons vertiques sphénoïdes